Exceptions

Exception Description
PC_​API_​ADD_​UPDATE_​GROUP_​FAILED Failed to create or change group '{0}'. Reason: {1}.
PC_​API_​AUTHENTICATION_​FAILURE_​GENERAL_​REASON Authentication failed.
PC_​API_​BASIC_​SCHEDULER_​DO_​NOT_​NEED_​VUSERS_​AMOUNT_​IN_​START_​VUSERS_​GLOBAL Invalid Global Scheduler. Do not provide the number of Vusers in a Basic Scheduler Start Vusers action.
PC_​API_​BASIC_​SCHEDULER_​DO_​NOT_​NEED_​VUSERS_​AMOUNT_​IN_​START_​VUSERS_​GROUP Invalid Group Scheduler of group '{0}'. Do not provide the number of Vusers in a Basic Scheduler Start Vusers action.
PC_​API_​BASIC_​SCHEDULER_​DO_​NOT_​NEED_​VUSERS_​AMOUNT_​IN_​STOP_​VUSERS_​GLOBAL Invalid Global Scheduler. Do not provide the number of Vusers in a Basic Scheduler Stop Vusers action.
PC_​API_​BASIC_​SCHEDULER_​DO_​NOT_​NEED_​VUSERS_​AMOUNT_​IN_​STOP_​VUSERS_​GROUP Invalid Group Scheduler of group '{0}'. Do not provide the number of Vusers in a Basic Scheduler Stop Vusers action.
PC_​API_​EMPTY_​RUN_​REQESUT Failed to extract Run data from the request. Ensure that: data passed to the HTTP request body is the same type as the Content-Type header value; the namespace matches the documentation specification; the XMLS root element is {0}.
PC_​API_​FAILED_​RETERIVE_​LOCK_​FOR_​EDIT_​LOAD_​TEST Test {0} is locked by other user.
PC_​API_​FAILED_​TO_​AUTHENTICATE Authentication failed.
PC_​API_​FAILED_​TO_​CREATE_​LOAD_​TEST Failed to create performance test. domain: {0}, project: {1} . Reason: {2}.
PC_​API_​FAILED_​TO_​CREATE_​RESERVATION_​FOR_​RUN Failed to create reservation for new run.
PC_​API_​FAILED_​TO_​DELETE_​GROUP Failed to delete group. domain {0}, project {1}, load test {2}, group {3}. Reason: {4}.
PC_​API_​FAILED_​TO_​DELETE_​GROUPS Failed to delete groups. domain {0}, project {1}, load test {2}. Reason: {3}.
PC_​API_​FAILED_​TO_​DELETE_​LOAD_​TEST Failed to delete test {0}. Reason: {1}.
PC_​API_​FAILED_​TO_​DOWNLOAD_​RUN_​RESULT_​DATA Failed to download data of result {0} of run {1}.
PC_​API_​FAILED_​TO_​GET_​RUN_​RESULTS_​DATA Failed to retrieve results data for run {0}.
PC_​API_​FAILED_​TO_​GET_​RUN_​RESULT_​DATA Failed to retrieve data of result {0} of run {1}.
PC_​API_​FAILED_​TO_​LOGOUT Failed to log off server. Resend request.
PC_​API_​FAILED_​TO_​RETRIEVE_​ALL_​RUNS Failed to retrieve Runs data from domain {0}, project {1}.
PC_​API_​FAILED_​TO_​RETRIEVE_​ALL_​RUNS_​FILTERED Failed to retrieve Runs data from domain {0}, project {1}. {2}
PC_​API_​FAILED_​TO_​RETRIEVE_​RESERVATION_​AVAILABILITY_​INFORMATION Failed to retrieve reservation availability information.
PC_​API_​FAILED_​TO_​RETRIEVE_​RESERVATION_​INFORMATION Failed to retrieve reservation information for reservation {0}.
PC_​API_​FAILED_​TO_​RETRIEVE_​RUN_​INFORMATION Failed to retrieve run {0} information from domain {1}, project {2}.
PC_​API_​FAILED_​TO_​START_​RUN Failed to start run. domain: {0}, project: {1}, test instance {2}, test {3}.
PC_​API_​FAILED_​TO_​START_​RUN_​INVALID_​RESERATION Failed to start run. Reservation {5} does not apply. domain {0}, project {1}, test set {2}, test instance {3}, test {4}.
PC_​API_​FAILED_​TO_​START_​RUN_​WITH_​FAILURE_​DETAILS Failed to start run because {4}. domain: {0}, project: {1}, test instance {2}, test {3}.
PC_​API_​FAILED_​TO_​STOP_​RUN Failed to stop run {0}, domain: {1}, project: {2}.
PC_​API_​FAILED_​TO_​STOP_​RUN_​FAILURE_​IN_​RETRIEVING_​RUN_​DATA Failed to stop run {0} due to failure retrieving run data. Resend stop request. domain: {1}, project: {2}.
PC_​API_​FORBIDDEN_​STOP_​VUSERS_​ACTION_​GLOBAL Invalid Global Scheduler. Stop Vusers Action is valid only after Duration action of type 'Run For'.
PC_​API_​FORBIDDEN_​STOP_​VUSERS_​ACTION_​GROUP Invalid Group Scheduler of group '{0}'. Stop Vusers Action is valid only after Duration action of type 'Run For'.
PC_​API_​GENERAL_​ERROR Operation failed.
PC_​API_​GET_​GROUPS_​LOAD_​TEST_​FAILED Failed to get groups of performance test with ID {0}.
PC_​API_​GET_​GROUP_​LOAD_​TEST_​FAILED Failed to get group {1} of performance test with ID {1}.
PC_​API_​GET_​LOAD_​TESTS_​FAILED Failed to get performance tests.
PC_​API_​GET_​LOAD_​TEST_​FAILED Failed to get performance test with ID {0}.
PC_​API_​GROUP_​NOT_​EXISTS Group '{0}' does not exist in load test with ID {1}.
PC_​API_​HOST_​DOES_​NOT_​EXISTS Host '{0}' does not exist.
PC_​API_​ILLEGAL_​RUN_​OPERATION Invalid run operation. '{0}' is illegal operation, please check PC API documentation for legal run operations.
PC_​API_​ILLEGAL_​TOTAL_​VUSER_​FEILED Illegal design load request. 'TotalVusers' is allowed only when scheduler is basic, by test and percentage mode.
PC_​API_​INCONSITENT_​GROUP_​NAME Inconsistent group name. The Group name is '{0}'. The Group name in the request is '{1}'.
PC_​API_​INVALID_​ADD_​LICENSES_​REQUEST_​WRONG_​PROJECT Invalid add licenses request. Verify that the project name is 'LAB_​PROJECT'.
PC_​API_​INVALID_​CREATE_​TEST_​INSTANCE_​REQUEST Invalid request. Ensure that the request starts with a 'TestInstance' tag and contains a PC API namespace.
PC_​API_​INVALID_​DURATION_​ACTION_​IN_​REAL_​WORLD_​SCHEDULER_​GLOBAL Invalid Global Scheduler. In the Real-World Scheduler, a Duration action must be of type 'Run For'.
PC_​API_​INVALID_​DURATION_​ACTION_​IN_​REAL_​WORLD_​SCHEDULER_​GROUP Invalid Group Scheduler of group '{0}'. In the Real-World Scheduler, a Duration action must be of type 'Run For'.
PC_​API_​INVALID_​DURATION_​FOR_​REAL_​WORLD_​SCHEDULER_​GLOBAL Invalid Global Scheduler. In the Real-World Scheduler, a Duration action must be of type 'Run For'.
PC_​API_​INVALID_​DURATION_​FOR_​REAL_​WORLD_​SCHEDULER_​GROUP Invalid Group Scheduler of group '{0}'. In the Real-World Scheduler, a Duration action must be of type 'Run For'.
PC_​API_​INVALID_​DURATION_​TYPE_​GLOBAL Invalid Global Scheduler. A Duration type must be one of '{0}','{1}', or '{2}'.
PC_​API_​INVALID_​DURATION_​TYPE_​GROUP Invalid Group Scheduler of group '{0}'. A Duration type must be one of '{0}','{1}', or '{2}'.
PC_​API_​INVALID_​GLOBAL_​SCHEDLUER_​CONTAINS_​START_​GROUP_​ACTIONS Invalid Global Scheduler. Global Scheduler cannot contain 'StartGroup' action.
PC_​API_​INVALID_​GLOBAL_​SCHEDLUER_​EMPTY_​ACTION Invalid Global Scheduler. Ensure that each action contains one of the following 'StartGroup', 'Initilize', 'StartVusers' , 'Duration', or 'StopVusers'.
PC_​API_​INVALID_​GLOBAL_​SCHEDLUER_​MORE_​THAN_​ONE_​ACTION Invalid Global Scheduler. Ensure that each action contains only one of the following 'StartGroup', 'Initilize', 'StartVusers' , 'Duration' or 'StopVusers'.
PC_​API_​INVALID_​GLOBAL_​SCHEDULER_​CANNOT_​STOP_​VUSERS_​MORE_​THAN_​STARTED Invalid Global Scheduler. Total stopped vusers must be less than or equal to total started vusers.
PC_​API_​INVALID_​GROUPS_​SCHEDULER_​START_​GROUPS_​CONTAINS_​CYCLES Invalid Groups Schedulers. Ensure that 'Start Group' phase does not contain cycles.
PC_​API_​INVALID_​GROUP_​SCHEDLUER_​EMPTY_​ACTION Invalid Group Scheduler of group '{0}'. Ensure that each action contains only one of the following 'StartGroup', 'Initilize', 'StartVusers' , 'Duration' or 'StopVusers'.
PC_​API_​INVALID_​GROUP_​SCHEDLUER_​MORE_​THAN_​ONE_​ACTION Invalid Group Scheduler of group '{0}'. Ensure that each action contains only one of the following 'StartGroup', 'Initilize', 'StartVusers' , 'Duration' or 'StopVusers'.
PC_​API_​INVALID_​HOSTS_​ASSIGNMENT_​MODE_​ASSIGN_​ALL Hosts cannot be assigned if the Load Generator distribution mode is 'Assign all Load Generators to each group'.
PC_​API_​INVALID_​HOSTS_​ASSIGNMENT_​MODE_​ASSIGN_​MANUALLY Hosts must be assigned if the Load Generator distribution mode is 'Assign Load Generator to group manually'.
PC_​API_​INVALID_​HOST_​TYPE Invalid Host type. Host type must be {0} or {1}.
PC_​API_​INVALID_​INIT_​DATA_​GRADUALLY_​TIME_​INTERVAL_​MISSING_​GLOBAL Invalid Global Scheduler. An Initialize action of type 'Gradually' must contain a time interval description.
PC_​API_​INVALID_​INIT_​DATA_​GRADUALLY_​TIME_​INTERVAL_​MISSING_​GROUP Invalid Group Scheduler of group '{0}'. An Initialize action of type 'Gradually' must contain a time interval description.
PC_​API_​INVALID_​INIT_​DATA_​GRADUALLY_​VUSERS_​AMOUNT_​ABOVE_​TOTAL_​VUSERS_​GLOBAL Invalid Global Scheduler. In an Initialize action of type 'Gradually', the number of Vusers must be less than the total Vusers allocated to the test.
PC_​API_​INVALID_​INIT_​DATA_​GRADUALLY_​VUSERS_​AMOUNT_​ABOVE_​TOTAL_​VUSERS_​GROUP Invalid Group Scheduler of group '{0}'. In an Initialize action of type 'Gradually', the number of Vusers must be less than the total Vusers allocated to the group.
PC_​API_​INVALID_​INIT_​DATA_​GRADUALLY_​VUSERS_​AMOUNT_​GLOBAL Invalid Global Scheduler. In an Initialize action of type 'Gradually', the number of Vusers must be an integer greater than zero.
PC_​API_​INVALID_​INIT_​DATA_​GRADUALLY_​VUSERS_​AMOUNT_​GROUP Invalid Group Scheduler of group '{0}'. An Initialize action of type 'Simultaneously' or 'Gradually' must contain a 'Waiting after' initialization description.
PC_​API_​INVALID_​INIT_​DATA_​WAIT_​AFTER_​INIT_​MISSING_​GLOBAL Invalid Global Scheduler. An Initialize action of type 'Simultaneously' or 'Gradually' must contain a 'Waiting after' initialization description.
PC_​API_​INVALID_​INIT_​DATA_​WAIT_​AFTER_​INIT_​MISSING_​GROUP Invalid Group Scheduler of group '{0}'. An Initialize action of type 'Simultaneously' or 'Gradually' must contain a 'Waiting after' initialization description.
PC_​API_​INVALID_​INIT_​TYPE_​GLOBAL Invalid Global Scheduler'. An Initialize action type must be one of '{0}', '{1}' or '{2}'.
PC_​API_​INVALID_​INIT_​TYPE_​GROUP Invalid Group Scheduler of group '{0}'. An Initialize action type must be one of '{0}', '{1}' or '{2}'.
PC_​API_​INVALID_​LOAD_​TEST_​ALL_​READY_​EXISTS Invalid design performance test request. A performance test named '{0}' in folder '{1}' already exists.
PC_​API_​INVALID_​LOAD_​TEST_​CONTENT_​CONTROLLER_​NOT_​EXISTS Invalid design performance test request. Controller '{0}' does not exist.
PC_​API_​INVALID_​LOAD_​TEST_​CONTENT_​GROUP_​NAME_​CANNOT_​BE_​EMPTY_​STRING Invalid design performance test request. Group name cannot be an empty string.
PC_​API_​INVALID_​LOAD_​TEST_​CONTENT_​ILLEGAL_​LG_​DISTRIBUTION Invalid design performance test request. Load Generators distribution must be '{0}' or '{1}'.
PC_​API_​INVALID_​LOAD_​TEST_​CONTENT_​ILLEGAL_​WORLOAD_​SUBTYPE Invalid design performance test request. Workload subtype must be '{0}' or '{1}'.
PC_​API_​INVALID_​LOAD_​TEST_​CONTENT_​ILLEGAL_​WORLOAD_​TYPE Invalid design performance test request. Workload type must be '{0}' or '{1}'.
PC_​API_​INVALID_​LOAD_​TEST_​CONTENT_​ILLEGAL_​WORLOAD_​VUSERS_​DISTRIBUTION Invalid design performance test request. Vuser distribution must be '{0}' or '{1}'.
PC_​API_​INVALID_​LOAD_​TEST_​CONTENT_​INVALID_​AMOUNT_​OF_​LGS Invalid design performance test request. The number of Load Generators must be an integer greater than zero.
PC_​API_​INVALID_​LOAD_​TEST_​CONTENT_​INVALID_​GROUP Invalid design performance test request. Ensure that each 'Group' is defined correctly under 'Groups'.
PC_​API_​INVALID_​LOAD_​TEST_​CONTENT_​INVALID_​GROUPS Invalid design performance test request. Ensure that 'Groups' is defined correctly under 'Content'.
PC_​API_​INVALID_​LOAD_​TEST_​CONTENT_​INVALID_​WORKLOAD Invalid design performance test request. Ensure that 'Workload' is defined correctly under 'Content'.
PC_​API_​INVALID_​LOAD_​TEST_​CONTENT_​INVALID_​WORKLOAD_​SUBTYPE Invalid design performance test request. Ensure that 'SubType' is defined correctly under 'Workload'.
PC_​API_​INVALID_​LOAD_​TEST_​CONTENT_​INVALID_​WORKLOAD_​TYPE Invalid design performance test request. Ensure that 'Type' is defined correctly under 'Workload'.
PC_​API_​INVALID_​LOAD_​TEST_​CONTENT_​INVALID_​WORKLOAD_​VUSERS_​DISTRIBUTION Invalid design performance test request. When Workload 'Type' is 'By Test', you must configure 'VuserDistribution' under 'Workload'.
PC_​API_​INVALID_​LOAD_​TEST_​CONTENT_​MISSING_​LG_​DISTRIBUTION Invalid design performance test request. Ensure that 'Type' is defined correctly under 'LGDistribution'.
PC_​API_​INVALID_​LOAD_​TEST_​CONTENT_​NOT_​ALLOWED_​WORLOAD_​VUSERS_​DISTRIBUTION Invalid design performance test request. When Workload 'Type' is 'By Group', you cannot define 'VuserDistribution' under 'Workload'.
PC_​API_​INVALID_​LOAD_​TEST_​CONTENT_​TOTAL_​VUSER_​AMOUNT_​MUST_​BE_​NON_​NEGIATIVE_​INTEGER Invalid design performance test request. When Workload type is 'Basic', subtype is 'By Test', and Vusers distribution is 'By Percentage', you must configure 'TotalVusers' as an integer greater than or equal to zero.
PC_​API_​INVALID_​LOAD_​TEST_​ID Invalid load test ID: {0}. The ID must be an integer greater than or equal to zero.
PC_​API_​INVALID_​LOAD_​TEST_​REQUEST Invalid design performance test request.Ensure that tag name is 'Test' and the request must contain a PC API namespace. Verify that all mandatory fields are defined.
PC_​API_​INVALID_​LOAD_​TEST_​REQUEST_​MISSING_​CONTENT Invalid design performance test request. Ensure that 'Content' is defined correctly under 'Test'.
PC_​API_​INVALID_​LOAD_​TEST_​UPDATE_​REQUEST Invalid design performance test request. Ensure that tag name is 'Content' and contains PC API namespace.Verify that all mandatory fields (as define in the PC API documentation) are defined.
PC_​API_​INVALID_​META_​DATA_​REQUEST_​ILLEGAL_​TEST_​NAME Invalid design performance test request. Test name '{0}' cannot contain one of the following characters '{1}'.
PC_​API_​INVALID_​META_​DATA_​REQUEST_​INVALID_​TEST_​NAME Invalid design performance test request. Ensure that 'Name' is defined correctly.
PC_​API_​INVALID_​META_​DATA_​REQUEST_​MISSING_​TEST_​FOLDER_​PATH Invalid design performance test request. Ensure that 'TestFolderPath' is defined correctly.
PC_​API_​INVALID_​META_​DATA_​REQUEST_​MISSING_​TEST_​NAME Invalid design performance test request. Test name cannot be an empty string.
PC_​API_​INVALID_​META_​DATA_​REQUEST_​NOT_​EXISTED_​TEST_​FOLDER_​PATH Invalid design performance test request. Folder path '{0}' not found.
PC_​API_​INVALID_​REQUEST Invalid Request. Verify that all mandatory fields are defined and that root element contains a PC API namespace.
PC_​API_​INVALID_​RTS_​ILLEGAL_​CACHE_​SIZE Invalid Run-Time Setting of group '{0}'. 'CacheSize' must be an integer between 1 and 100.
PC_​API_​INVALID_​RTS_​LOG_​DISABLED_​UNEXPECTED_​ADVANCE_​TRACE Invalid Run-Time Setting of group '{0}'. When 'Log' is of type '{1}', do not specify an 'AdvanceTrace'.
PC_​API_​INVALID_​RTS_​LOG_​DISABLED_​UNEXPECTED_​DATA_​RETURNED_​BY_​SERVER Invalid Run-Time Setting of group '{0}'. When 'Log' is of type '{1}', do not specify a 'DataReturnByServer'.
PC_​API_​INVALID_​RTS_​LOG_​DISABLED_​UNEXPECTED_​LOG_​OPTIONS Invalid Run-Time Setting of group '{0}'. When Log is disabled, do not specify 'LogOptions'.
PC_​API_​INVALID_​RTS_​LOG_​LOG_​OPTION_​TYPE Invalid Run-Time Setting of group '{0}'. 'LogOptions' type must be either '{1}' or '{2}'.
PC_​API_​INVALID_​RTS_​LOG_​MIN_​PERCENTAGE_​HIGHER_​THAN_​MAX_​PERCENTAGE Invalid Run-Time Setting of group '{0}'. 'MinPercentage' must be less than or equal to 'MaxPercentage'.
PC_​API_​INVALID_​RTS_​LOG_​MISSING_​LOG_​OPTION_​TYPE Invalid Run-Time Setting of group '{0}'. Missing 'Type' under 'LogOptions' in 'Log'.
PC_​API_​INVALID_​RTS_​LOG_​MISSING_​TYPE Invalid Run-Time Setting of group '{0}'. Missing 'Type' in 'Log'.
PC_​API_​INVALID_​RTS_​LOG_​NEGATIVE_​LIMIT_​THINK_​TIME_​SECONDS Invalid Run-Time Setting of group '{0}'. 'LimitThinkTimeSeconds' must be an integer greater than zero.
PC_​API_​INVALID_​RTS_​LOG_​NEGATIVE_​MAX_​PERCENTAGE Invalid Run-Time Setting of group '{0}'. 'MaxPercentage' must be an integer greater than zero.
PC_​API_​INVALID_​RTS_​LOG_​NEGATIVE_​MIN_​PERCENTAGE Invalid Run-Time Setting of group '{0}'. 'MinPercentage' must be an integer greater than zero.
PC_​API_​INVALID_​RTS_​LOG_​NON_​POSITIVE_​MULTIPLY_​FACTOR Invalid Run-Time Setting of group '{0}'. 'MultiplyFactor' must be an integer greater than zero.
PC_​API_​INVALID_​RTS_​LOG_​TYPE Invalid Run-Time Setting of group '{0}'. 'Log' type must be either '{1}', '{2}', or '{3}'.
PC_​API_​INVALID_​RTS_​LOG_​UNEXPECTED_​LINIT_​THINK_​TIME_​SECONDS Invalid Run-Time Setting of group '{0}'. When 'ThinkTime' is of type '{1}', do not specify 'LimitThinkTimeSeconds'.
PC_​API_​INVALID_​RTS_​LOG_​UNEXPECTED_​MAX_​PERCENTAGE Invalid Run-Time Setting of group '{0}'. When 'ThinkTime' is of type '{1}', do not specify 'MaxPercentage'.
PC_​API_​INVALID_​RTS_​LOG_​UNEXPECTED_​MIN_​PERCENTAGE Invalid Run-Time Setting of group '{0}'. When 'ThinkTime' is of type '{1}', do not specify 'MinPercentage'.
PC_​API_​INVALID_​RTS_​LOG_​UNEXPECTED_​MULTIPLY_​FACTOR Invalid Run-Time Setting of group '{0}'. When 'ThinkTime' is of type '{1}', do not specify 'MultiplyFactor'.
PC_​API_​INVALID_​RTS_​LOG_​UNEXPECTED_​PARAMERTERS_​SUBSTITUTION Invalid Run-Time Setting of group '{0}'. When 'Log' is of type '{1}', do not specify 'ParametersSubstituion'.
PC_​API_​INVALID_​RTS_​PACING_​DELAY_​AT_​RANGE_​OF_​SECONDS_​HIGHER_​THAN_​DELAY_​AT_​RANGE_​TO_​SECONDS Invalid Run-Time Setting of group '{0}'. 'DelayAtRangeOfSeconds' must be less than or equal to 'DelayAtRangeToSeconds'.
PC_​API_​INVALID_​RTS_​PACING_​MISSING_​START_​NEW_​ITERATION_​TYPE Invalid Run-Time Setting of group '{0}'. Missing 'Type' under 'StartNewIteration' in Pacing.
PC_​API_​INVALID_​RTS_​PACING_​NEGATIVE_​DELAY_​AT_​RANGE_​OF_​SECONDS Invalid Run-Time Setting of group '{0}'. 'DelayAtRangeOfSeconds' must be greater than or equal to zero.
PC_​API_​INVALID_​RTS_​PACING_​NEGATIVE_​DELAY_​AT_​RANGE_​TO_​SECONDS Invalid Run-Time Setting of group '{0}'. 'DelayAtRangeToSeconds' must be greater than or equal to zero.
PC_​API_​INVALID_​RTS_​PACING_​NEGATIVE_​DELAY_​OF_​SECONDS Invalid Run-Time Setting of group '{0}'. 'DelayOfSeconds' must be greater than or equal to zero.
PC_​API_​INVALID_​RTS_​PACING_​NEGATIVE_​NUM_​OF_​ITERATIONS Invalid Run-Time Setting of group '{0}'. In Pacing, the number of iterations must be an integer greater than or equal to zero.
PC_​API_​INVALID_​RTS_​PACING_​TYPE Invalid Run-Time Setting of group '{0}'. 'StartNewIteration' type must be one of '{1}', '{2}', '{3}', '{4}' or '{5}'.
PC_​API_​INVALID_​RTS_​PACING_​UNEXPECTED_​PARAMETER_​DELAY_​AT_​RANGE_​OF_​SECONDS Invalid Run-Time Setting of group '{0}'. When 'StartNewIteration' is of type '{1}', do not specify a 'DelayAtRangeOfSeconds'.
PC_​API_​INVALID_​RTS_​PACING_​UNEXPECTED_​PARAMETER_​DELAY_​AT_​RANGE_​TO_​SECONDS Invalid Run-Time Setting of group '{0}'. When 'StartNewIteration' is of type '{1}', do not specify a 'DelayAtRangeToSeconds'.
PC_​API_​INVALID_​RTS_​PACING_​UNEXPECTED_​PARAMETER_​DELAY_​OF_​SECONDS Invalid Run-Time Setting of group '{0}'. When 'StartNewIteration' is of type '{1}', do not specify a 'DelayOfSeconds'.
PC_​API_​INVALID_​RTS_​THINK_​TIME_​MISSING_​TYPE Invalid Run-Time Setting of group '{0}'. Missing 'Type' in 'ThinkTime'.
PC_​API_​INVALID_​RTS_​THINK_​TIME_​TYPE Invalid Run-Time Setting of group '{0}'. 'ThinkTime' type must be one of '{1}', '{2}','{3}' or '{4}'.
PC_​API_​INVALID_​RTS_​UNEXPECTED_​CACHE_​SIZE Invalid Run-Time Setting of group '{0}'. When 'LogOptions' is of type 'always', do not specify a 'Cache size'.
PC_​API_​INVALID_​RUN_​ID Invalid run ID: {0}.
PC_​API_​INVALID_​RUN_​STATE_​FOR_​STOP_​REQUEST Run {0} cannot stop because the run state is {1}.
PC_​API_​INVALID_​SCRIPT_​DATA The group entity does not contain a valid script entity.
PC_​API_​INVALID_​START_​GROUP The Group Scheduler of group '{0}' contains more than one 'Start Group' action.
PC_​API_​INVALID_​START_​GROUP_​DATA_​GROUP_​DOES_​NOT_​EXISTS Invalid Group Scheduler of group '{0}'. You cannot schedule group '{0}' to start after group '{1}' because group '{1}' does not exist.
PC_​API_​INVALID_​START_​GROUP_​DATA_​GROUP_​NAME_​MISSING Invalid Group Scheduler of group '{0}'. A Start Group of type 'Start after group' must contain a group name description.
PC_​API_​INVALID_​START_​GROUP_​DATA_​TIME_​INTERVAL_​MISSING Invalid Group Scheduler of group '{0}'. A Start Group of type 'start with delay' must contain a time interval description.
PC_​API_​INVALID_​START_​GROUP_​IN_​GLOBAL_​SCHEDULER Invalid Global Scheduler. A Start Group action can be defined only in the Group Scheduler.
PC_​API_​INVALID_​START_​GROUP_​TYPE Invalid Group Scheduler of group '{0}'. The Start Group type must be '{1}', '{2}', or '{3}'.
PC_​API_​INVALID_​START_​GROUP_​USAGE Invalid Scheduler action. Start Group is not a valid action in Global Scheduler.
PC_​API_​INVALID_​START_​VUSERS_​TYPE_​GLOBAL Invalid Global Scheduler. Start Vusers type must be '{0}' or '{1}'.
PC_​API_​INVALID_​START_​VUSERS_​TYPE_​GROUP Invalid Group Scheduler of group '{0}'. Start Vusers type must be '{0}' or '{1}'.
PC_​API_​INVALID_​STOP_​OPTION Invalid stop option '{0}' for run {1}.
PC_​API_​INVALID_​STOP_​VUSERS_​TYPE_​GLOBAL Invalid Global Scheduler. Stop Vusers type must be '{0}' or '{1}'.
PC_​API_​INVALID_​STOP_​VUSERS_​TYPE_​GROUP Invalid Group Scheduler of group '{0}'. Stop Vusers type must be '{0}' or '{1}'.
PC_​API_​INVALID_​USER_​CREDENTIALS Invalid user name or password.
PC_​API_​INVALID_​WORKLOAD_​SUBTYPE Invalid create/design performance test request. Ensure that 'SubType' in 'Workload type' is '{0}' or '{1}'.
PC_​API_​INVALID_​WORKLOAD_​TYPE Invalid create/design performance test request. Ensure that 'Type' in 'Workload type' is '{0}' or '{1}'.
PC_​API_​LOAD_​TEST_​NOT_​EXISTS Load Test {0} does not exist.
PC_​API_​MISSING_​ACTIONS_​IN_​REAL_​WORLD_​SCHEDULER_​GLOBAL Invalid Global Scheduler. In the Real-World Scheduler, at least one action in addition to Initialize must be defined.
PC_​API_​MISSING_​ACTIONS_​IN_​REAL_​WORLD_​SCHEDULER_​GROUP Invalid Group Scheduler of group '{0}'. In the Real-World Scheduler, at least one action in addition to Initialize must be defined.
PC_​API_​MISSING_​AUTHENTICATION_​INFORMATION Authentication information is missing from request header.
PC_​API_​MISSING_​DURATION_​ACTION_​GLOBAL Invalid Global Scheduler. The Duration Action is missing or in the wrong order. In the Basic Global Scheduler, if the duration is of type 'Run For', the order must be: Initialize, Start Vusers, Duration, and Stop Vusers.
PC_​API_​MISSING_​DURATION_​ACTION_​GROUP Invalid Group Scheduler of group '{0}'. The Duration Action is missing or in the wrong order. In the Basic Global Scheduler, if the duration is of type 'Run For', the order must be: Start Group, Initialize, Start Vusers, Duration, and Stop Vusers.
PC_​API_​MISSING_​GROUP_​SCHEDULER No Group Scheduler for group '{0}'. If workload is scheduled by group, ensure that the group has a valid Group Scheduler.
PC_​API_​MISSING_​HOST_​NAME Host name is missing. Ensure that all hosts entities have a name.
PC_​API_​MISSING_​HOST_​TYPE Host type in missing. Ensure that all hosts entities have a type.
PC_​API_​MISSING_​INIT_​GROUP_​GLOBAL Invalid Global Scheduler. Initialize Action is missing.
PC_​API_​MISSING_​INIT_​GROUP_​GROUP Invalid Group Scheduler of group '{0}'. Initialize Action is missing.
PC_​API_​MISSING_​RAMP_​GLOBAL Invalid Global Scheduler. Provide a Ramp field in Start/Stop Vusers of type 'Gradually'.
PC_​API_​MISSING_​RAMP_​GROUP Invalid Group Scheduler of group '{0}'. Provide a Ramp field in Start/Stop Vusers of type 'Gradually'.
PC_​API_​MISSING_​START_​GROUP Invalid Group Scheduler of group '{0}'. The first action must be of type 'Start Group'.
PC_​API_​MISSING_​START_​VUSER_​ACTION_​GLOBAL Invalid Global Scheduler. The Start Vusers Action is missing or in the wrong order. In the Basic Global Scheduler, if the duration is of type 'Run For', the order must be: Initialize, Start Vusers, Duration, and Stop Vusers.
PC_​API_​MISSING_​START_​VUSER_​ACTION_​GROUP Invalid Group Scheduler of group '{0}'. The Start Vusers Action is missing or in the wrong order. In the Basic Global Scheduler, if the duration is of type 'Run For', the order must be: Start Group, Initialize, Start Vusers, Duration, and Stop Vusers'.
PC_​API_​MISSING_​STOP_​VUSERS_​ACTION_​GLOBAL Invalid Global Scheduler. The Stop Vusers Action is missing or in the wrong order. In the Basic Global Scheduler, if the duration is of type 'Run For', the order must be: Initialize, Start Vusers, Duration and Stop Vusers.
PC_​API_​MISSING_​STOP_​VUSERS_​ACTION_​GROUP Invalid Group Scheduler of group '{0}'. The Stop Vusers Action is missing or in the wrong order. In the Basic Global Scheduler, if the duration is of type 'Run For', the order must be: Start Group, Initialize, Start Vusers, Duration, and Stop Vusers .
PC_​API_​MISSING_​TIME_​INTERVAL_​IN_​DURATION_​ACTION_​GLOBAL Invalid Global Scheduler. The time interval in Duration is missing.
PC_​API_​MISSING_​TIME_​INTERVAL_​IN_​DURATION_​ACTION_​GROUP Invalid Group Scheduler of group '{0}'. The time interval in Duration is missing.
PC_​API_​MISSING_​TIME_​INTEVAL_​IN_​RAMP_​GLOBAL Invalid Global Scheduler. The time interval in Ramp of Start/Stop Vusers of type 'Gradually' is missing.
PC_​API_​MISSING_​TIME_​INTEVAL_​IN_​RAMP_​GROUP Invalid Group Scheduler of group '{0}'. The time interval in Ramp of Start/Stop Vusers of type 'Gradually' is missing.
PC_​API_​MISSING_​VUSERS_​IN_​RAMP_​GLOBAL Invalid Global Scheduler'. Provide the number of Vusers in Ramp of Start/Stop Vusers of type 'Gradually'.
PC_​API_​MISSING_​VUSERS_​IN_​RAMP_​GROUP Invalid Group Scheduler of group '{0}'. Provide the number of Vusers in Ramp of Start/Stop Vusers of type 'Gradually'.
PC_​API_​MISSING_​WORKLOAD Invalid create/design performance test request. Ensure that tag name 'WorkloadType' exists under 'Content'.
PC_​API_​MISSING_​WORKLOAD_​SUBTYPE Invalid create/design performance test request. Ensure that tag name is 'SubType' is exists under 'WorkloadType'.
PC_​API_​MISSING_​WORKLOAD_​TYPE Invalid create/design performance test request. Ensure that tag name is 'Type' is exists under 'WorkloadType'.
PC_​API_​MORE_​THAN_​ONE_​INIT_​GLOBAL Invalid Global Scheduler. Initialize must be the first action in the Global Scheduler. Initalize can be used only once in the schedule.
PC_​API_​MORE_​THAN_​ONE_​INIT_​GROUP Invalid Group Scheduler of group '{0}'. Initialize must be the second action in the Group Scheduler. Initalize can be used only once in the schedule.
PC_​API_​NEGATIVE_​VUSERS_​AMOUNT_​OR_​PERCENTAGE Vusers must be greater than or equal to zero.
PC_​API_​NON_​SUPPORTED_​OPERATION The operation requested is not supported for resource {0}.
PC_​API_​NOT_​NECESSARY_​GROUP_​SCHEDULER Invalid group data. When the Global Scheduler is set, you cannot define a Group Scheduler.
PC_​API_​NOT_​SUPPORTED_​ACCEPT_​TYPE Invalid request. The Accept header must be one of {0}.
PC_​API_​NOT_​SUPPORTED_​CONTENT_​TYPE Invalid request. The Content-Type header must be one of {0}.
PC_​API_​NO_​DATA_​ARRIVED Could not extract the requested post run action data from the request. Ensure that the following conditions are met: The data passed in the HTTP request body is the same type as the Content-Type header value. The namespace conforms to the documentation specification. The XML root element is {0}.
PC_​API_​NO_​RESOURCE_​TO_​HANDLE_​THE_​REQUEST Resource not found. See the PC API documentation for syntax details.
PC_​API_​PC_​FAILED_​TO_​CREAT_​TEST_​INSTANCE Failed to create test instance.
PC_​API_​PC_​TEST_​SET_​DO_​NOT_​EXISTS Test set '{0}'of type 'Performance' does not exist.
PC_​API_​POST_​RUN_​OPERATION_​DOES_​NOT_​ALLOWED Post run operation '{0}' is not allowed when run state is '{1}'.
PC_​API_​REAL_​WORLD_​SCHEDULER_​REQUIRED_​VUSERS_​AMOUNT_​IN_​START_​VUSERS_​GLOBAL Invalid Global Scheduler. In the Real-World Scheduler, in the Start Vusers action, provide the number of Vusers.
PC_​API_​REAL_​WORLD_​SCHEDULER_​REQUIRED_​VUSERS_​AMOUNT_​IN_​START_​VUSERS_​GROUP Invalid Group Scheduler of group '{0}'. In the Real-World Scheduler, in the Start Vusers action, provide the number of Vusers.
PC_​API_​REAL_​WORLD_​SCHEDULER_​VUSERS_​AMOUNT_​IN_​START_​VUSERS_​HIGHER_​EXCEEDED_​TOTAL_​VUSERS_​GLOBAL Invalid Global Scheduler. In the Real-World Scheduler, in the Start Vusers action, the number of Vusers is more than the total Vusers assigned to groups.
PC_​API_​REAL_​WORLD_​SCHEDULER_​VUSERS_​AMOUNT_​IN_​START_​VUSERS_​HIGHER_​EXCEEDED_​TOTAL_​VUSERS_​GROUP Invalid Group Scheduler of group '{0}'. In the Real-World Scheduler, in the Start Vusers action, the number of Vusers is more than the total Vusers assigned to groups.
PC_​API_​REAL_​WORLD_​SCHEDULER_​VUSERS_​AMOUNT_​IN_​STOP_​VUSERS_​HIGHER_​EXCEEDED_​TOTAL_​VUSERS_​GLOBAL Invalid Global Scheduler. In the Real-World Scheduler, in the Stop Vusers action, the number of Vusers is more than the total Vusers assigned to groups.
PC_​API_​REAL_​WORLD_​SCHEDULER_​VUSERS_​AMOUNT_​IN_​STOP_​VUSERS_​HIGHER_​EXCEEDED_​TOTAL_​VUSERS_​GROUP Invalid Group Scheduler of group '{0}'. In the Real-World Scheduler, in the Stop Vusers action, the number of Vusers is more than the total Vusers assigned to groups.
PC_​API_​REAL_​WORLD_​SCHEDULER_​VUSERS_​AMOUNT_​IN_​STOP_​VUSERS_​SHOULD_​BE_​NON_​NEGATIVE_​GLOBAL Invalid Global Scheduler'. In the Real-World Scheduler, in the Stop Vusers action, Vusers must be an integer greater than or equal to zero.
PC_​API_​REAL_​WORLD_​SCHEDULER_​VUSERS_​AMOUNT_​IN_​STOP_​VUSERS_​SHOULD_​BE_​NON_​NEGATIVE_​GROUP Invalid Group Scheduler of group '{0}'. In the Real-World Scheduler, in the Stop Vusers action, Vusers must be an integer greater than or equal to zero.
PC_​API_​RUN_​ID_​DOES_​NOT_​EXISTS Run with id '{0}' does not exist.
PC_​API_​RUN_​RESULT_​FILE_​DOES_​NOT_​EXIST Result file {0} of run {1} not found.
PC_​API_​RUN_​STARTED_​BUT_​FAILED_​TO_​RETRIEVE_​RUN_​INFORMATION Run was started with ID {0}, but there was a failure retrieving the run information. You can access the run by appending the run ID to the URL that was used for the Run creation request.
PC_​API_​SCRIPT_​DOES_​NOT_​EXISTS Script {0} does not exist.
PC_​API_​START_​GROUP_​CONTAINS_​CYCLE The Groups Scheduler contains circular start group conditions.
PC_​API_​TIME_​INTERVAL_​IN_​DURATION_​ACTION_​IS_​NOT_​POSITIVE_​GLOBAL Invalid Global Scheduler. Set the time interval in Duration greater than zero.
PC_​API_​TIME_​INTERVAL_​IN_​DURATION_​ACTION_​IS_​NOT_​POSITIVE_​GROUP Invalid Group Scheduler of group '{0}'. Set the time interval in Duration greater than zero.
PC_​API_​TIME_​INTERVAL_​IN_​INIT_​IS_​NOT_​POSITIVE_​GLOBAL Invalid Global Scheduler. If Initialize is of type 'Gradually', set the time interval greater than zero.
PC_​API_​TIME_​INTERVAL_​IN_​INIT_​IS_​NOT_​POSITIVE_​GROUP Invalid Group Scheduler of group '{0}'. If Initialize is of type 'Gradually', set the time interval greater than zero.
PC_​API_​TIME_​INTERVAL_​IN_​RAMP_​IS_​NOT_​POSITIVE_​GLOBAL Invalid Global Scheduler. Set the time interval in Ramp of Start/Stop Vusers of type 'Gradually' greater than zero.
PC_​API_​TIME_​INTERVAL_​IN_​RAMP_​IS_​NOT_​POSITIVE_​GROUP Invalid Group Scheduler of group '{0}'. Set the time interval in Ramp of Start/Stop Vusers of type 'Gradually' greater than zero.
PC_​API_​TIME_​INTERVAL_​IN_​START_​GROUP_​IS_​NOT_​POSITIVE Invalid Group Scheduler of group '{0}'. If Start Group is of type 'With Delay', set the time interval greater than zero.
PC_​API_​UNATHORIZATION_​EXCEPTION User unauthorized. Check permissions.
PC_​API_​UPDATE_​GROUP_​RTS_​FAILED Failed to update Run-Time Settings of group '{0}'. Reason: {1}.
PC_​API_​UPDATE_​LOAD_​TEST_​FAILED Failed to update performance test {0}. Reason: {1}.
PC_​API_​VUSERS_​IN_​RAMP_​EXCEEDED_​ALLOWED_​AMOUNT_​GLOBAL Invalid Global Scheduler. The number of Vusers in Ramp of Start/Stop Vusers of type 'Gradually' is either more than the total number of Vusers assigned to groups or more than the number of Vusers allocated to this action.
PC_​API_​VUSERS_​IN_​RAMP_​EXCEEDED_​ALLOWED_​AMOUNT_​GROUP Invalid Group Scheduler of group '{0}'. The number of Vusers in Ramp of Start/Stop Vusers of type 'Gradually' is either more than the total number of Vusers assigned to groups or more than the number of Vusers allocated to this action.
PC_​API_​WAIT_​AFTER_​INIT_​IS_​NOT_​POSITIVE_​GLOBAL Invalid Global Scheduler. Set the wait time after initialize greater than zero.
PC_​API_​WAIT_​AFTER_​INIT_​IS_​NOT_​POSITIVE_​GROUP Invalid Group Scheduler of group '{0}'. Set the wait time after initialize greater than zero.
PC_​INVALID_​ADD_​UPDATE_​GROUP Invalid group data.
PC_​INVALID_​UPDATE_​GROUP_​RTS Invalid Run-Time Settings of group '{0}'.